{"text_format":"1","workbook":"xlsx","n_sheets":7,"sheets":["入力手順","登録予定者","入力ｼｰﾄ","男子申込書","女子申込書","省略学校名","氏名ﾃﾞｰﾀ"],"not_rendered":{"charts":0,"images":0,"macros":1,"external_links":0,"defined_names":1,"comments":0,"pivot_tables":0},"unopened":[],"bounds":{"document_bytes":16777216,"sheet_cells":100000,"rows_first":2000,"rows_last":500,"rows_between":2000,"halvings":0,"cell_chars":16384,"cell_head_chars":4096},"cells_cut":0,"cells_raw":0,"read":"whole","date_system":"1900"}

{"sheet":"入力手順","index":0,"n_rows":87,"n_cols":16,"rows_kept":87,"cut":false,"hidden":false,"merged":[[34,3,34,4]]}
[null,null,null,null,"手順"]
[null,null,null,null,null,null,null,null,null,null,null,null,null,null,null,"以上"]
[null,null,null,null,null,null,null,null,null,null,null,null,null,null,null,"ここまで"]
[]
[]
[]
[]
[]
[]
[]
[null,null,null,"①登録予定者"]
[]
[null,null,null,"↓色つきの部分に数値や文字を入力をしてくだい。A票にリンクしています。"]
[null,null,null,"５桁","氏名","全角","ﾌﾘｶﾞﾅ","半角","学年","省略校名",null,"性別"]
[null,null,null,"半角","姓","名","姓","名","半角","６文字全角",null,"全角"]
[null,null,null,40380,"陸上","駅男","ﾘｸｼﾞｮｳ","ｴｷｵ",3,"都駅伝",null,"男"]
[null,null,null,57791,"長距離","走太","ﾁｮｳｷｮﾘ","ｿｳﾀ",1,"都駅伝",null,"女"]
[null,null,null,17201,"五千","飛子","ｺﾞｾﾝ","ﾄﾋﾞｺ",2,"都駅伝",null,"男"]
[null,null,null,67201,"駅伝","中子","ｴｷﾃﾞﾝ","ﾅｶｺ",1,"都駅伝",null,"女"]
[]
[]
[]
[]
[null,null,null,"②入力ｼｰﾄ"]
[]
[null,null,null,"競技会名",null,"新春駅伝競走大会",null,null,null,null,"←入力をしません"]
[null,null,null,"学校名（正式名称）",null,"東京都立阿佐ヶ谷高等学校"]
[null,null,null,"学校長名",null,"駅伝　校長"]
[null,null,null,"学校所在地","郵便番号","１６６－００１１",null,null,null,null,null,null,null,null,null,"以上"]
[null,null,null,null,"住所","東京都杉並区阿佐谷南１－２３－４５",null,null,null,null,null,null,null,null,null,"ここまで"]
{"$rows_left_out":58}
{"sheet":"登録予定者","index":1,"n_rows":103,"n_cols":10,"rows_kept":103,"cut":false,"hidden":false,"merged":[]}
[0,"５桁","氏名","全角","ﾌﾘｶﾞﾅ","半角","学年","省略校名","性別"]
[0.1,"半角","姓","名","姓","名","半角","６文字　全角","全角"]
[0.2,47201,"駅伝","走太","ｴｷﾃﾞﾝ","ｿｳﾀ",3,"都駅伝総合","男","←例"]
[1]
[2]
[3]
[4]
[5]
[6]
[7]
[8]
[9]
[10]
[11]
[12]
[13]
[14]
[15]
[16]
[17]
[18]
[19]
[20]
[21]
[22]
[23]
[24]
[25]
[26]
[27]
{"$rows_left_out":74}
{"sheet":"入力ｼｰﾄ","index":2,"n_rows":73,"n_cols":21,"rows_kept":73,"cut":false,"hidden":false,"merged":[[0,5,0,9],[9,3,9,4]]}
[{"$f":"CONCATENATE(A2,\"\\\",A3)","v":{"$error":"#N/A"}},null,null,"競技会名",null,"新春駅伝競走大会",null,null,null,null,"_R1新春駅伝"]
["C:\\Users\\T1027536\\Desktop\\部活関係\\陸上部",null,null,"学校名（正式名称）"]
[{"$f":"CONCATENATE(VALUE(F15*100+F16),F17,K1,A5)","v":{"$error":"#N/A"}},null,null,"学校長名"]
[{"$f":"NOW()","v":43744.459586921294},null,null,"学校所在地","郵便番号"]
[{"$f":"TEXT(A4,\"md\")","v":"106"},null,null,null,"住所"]
[null,null,null,null,"電話番号"]
[null,null,null,null,"ＦＡＸ番号"]
[null,null,null,"顧問氏名"]
[null,null,null,"連絡先"]
[{"$f":"F15*100+F16","v":0},{"$f":"F17","v":{"$error":"#N/A"}},null,"審判氏名（審判をお願いできる場合にはすべての方の氏名を入力してください）",null,null,null,null,null,null,{"$f":"F11","v":0}]
[null,null,null,"希望\n審判種別"]
[]
[null,null,null,null,null,"男子","女子"]
[null,null,null,"参加チーム数","（半角）",0,0]
[null,null,null,"支部","（半角）",null,"←４か５か６を入力します",null,null,null,null,null,null,null,{"$f":"VLOOKUP(F15*100+F16,省略学校名!B:F,5,0)","v":{"$error":"#N/A"}}]
[null,null,null,"学校番号","（半角）",null,"←２桁番号です",null,null,null,null,null,null,null,{"$f":"IF(ISERROR(VLOOKUP(F15*100+F16,省略学校名!B:F,5,0)),\"\",O15)","v":""}]
[null,null,null,"学校名（略称６文字）",null,{"$f":"VLOOKUP(F15*100+F16,省略学校名!B:F,5,FALSE)","v":{"$error":"#N/A"}},null,null,null,null,null,null,null,null,{"$f":"IF(O16=\"\",F17,O16)","v":{"$error":"#N/A"}}]
[]
[null,null,null,"男子出場選手情報"]
[null,null,null,null,"登録ﾅﾝﾊﾞｰ","氏名",null,"ﾌﾘｶﾞﾅ"]
["ﾅﾝﾊﾞｰ","支部",null,"Ａチーム","５桁(半角)","姓","名","姓","名","学年","性別",null,null,"性別","学校名","氏名","学年","支部","学校","参加","確認"]
[{"$f":"100000+B22*100+1","v":100001},{"$f":"$F$15*100+$F$16","v":0},1,"第１区",null,{"$f":"IF($E22=\"\",\"\",IF(ISERROR(VLOOKUP($E22,氏名ﾃﾞｰﾀ!$B:$I,2,0)),IF(ISERROR(VLOOKUP($E22,登録予定者!$B:$I,2,0)),\"未登録\",VLOOKUP($E22,登録予定者!$B:$I,2,0)),VLOOKUP($E22,氏名ﾃﾞｰﾀ!$B:$I,2,0)))","v":""},{"$f":"IF($E22=\"\",\"\",IF(ISERROR(VLOOKUP($E22,氏名ﾃﾞｰﾀ!$B:$I,3,0)),IF(ISERROR(VLOOKUP($E22,登録予定者!$B:$I,3,0)),\"未登録\",VLOOKUP($E22,登録予定者!$B:$I,3,0)),VLOOKUP($E22,氏名ﾃﾞｰﾀ!$B:$I,3,0)))","v":""},{"$f":"IF($E22=\"\",\"\",IF(ISERROR(VLOOKUP($E22,氏名ﾃﾞｰﾀ!$B:$I,4,0)),IF(ISERROR(VLOOKUP($E22,登録予定者!$B:$I,4,0)),\"未登録\",VLOOKUP($E22,登録予定者!$B:$I,4,0)),VLOOKUP($E22,氏名ﾃﾞｰﾀ!$B:$I,4,0)))","v":""},{"$f":"IF($E22=\"\",\"\",IF(ISERROR(VLOOKUP($E22,氏名ﾃﾞｰﾀ!$B:$I,5,0)),IF(ISERROR(VLOOKUP($E22,登録予定者!$B:$I,5,0)),\"未登録\",VLOOKUP($E22,登録予定者!$B:$I,5,0)),VLOOKUP($E22,氏名ﾃﾞｰﾀ!$B:$I,5,0)))","v":""},{"$f":"IF($E22=\"\",\"\",IF(ISERROR(VLOOKUP($E22,氏名ﾃﾞｰﾀ!$B:$I,6,0)),IF(ISERROR(VLOOKUP($E22,登録予定者!$B:$I,6,0)),\"未登録\",VLOOKUP($E22,登録予定者!$B:$I,6,0)),VLOOKUP($E22,氏名ﾃﾞｰﾀ!$B:$I,6,0)))","v":""},"男",null,null,1,{"$f":"CONCATENATE($O$17,IF($E$29=\"\",\"\",\"Ａ\"))","v":{"$error":"#N/A"}},{"$f":"IF(E22=\"\",\"\",CONCATENATE(F22,\"　\",G22))","v":""},{"$f":"IF(E22=\"\",\"\",J22)","v":""},{"$f":"IF(E22=\"\",\"\",$F$15)","v":""},{"$f":"IF(U22=\"\",\"\",RIGHT(B22,2))","v":""},{"$f":"IF(U22=\"\",1,0)","v":1},{"$f":"IF($E$22=\"\",\"\",B22*10+1)","v":""}]
[{"$f":"100000+B23*100+2","v":100002},{"$f":"$F$15*100+$F$16","v":0},2,"第２区",null,{"$f":"IF($E23=\"\",\"\",IF(ISERROR(VLOOKUP($E23,氏名ﾃﾞｰﾀ!$B:$I,2,0)),IF(ISERROR(VLOOKUP($E23,登録予定者!$B:$I,2,0)),\"未登録\",VLOOKUP($E23,登録予定者!$B:$I,2,0)),VLOOKUP($E23,氏名ﾃﾞｰﾀ!$B:$I,2,0)))","v":""},{"$f":"IF($E23=\"\",\"\",IF(ISERROR(VLOOKUP($E23,氏名ﾃﾞｰﾀ!$B:$I,3,0)),IF(ISERROR(VLOOKUP($E23,登録予定者!$B:$I,3,0)),\"未登録\",VLOOKUP($E23,登録予定者!$B:$I,3,0)),VLOOKUP($E23,氏名ﾃﾞｰﾀ!$B:$I,3,0)))","v":""},{"$f":"IF($E23=\"\",\"\",IF(ISERROR(VLOOKUP($E23,氏名ﾃﾞｰﾀ!$B:$I,4,0)),IF(ISERROR(VLOOKUP($E23,登録予定者!$B:$I,4,0)),\"未登録\",VLOOKUP($E23,登録予定者!$B:$I,4,0)),VLOOKUP($E23,氏名ﾃﾞｰﾀ!$B:$I,4,0)))","v":""},{"$f":"IF($E23=\"\",\"\",IF(ISERROR(VLOOKUP($E23,氏名ﾃﾞｰﾀ!$B:$I,5,0)),IF(ISERROR(VLOOKUP($E23,登録予定者!$B:$I,5,0)),\"未登録\",VLOOKUP($E23,登録予定者!$B:$I,5,0)),VLOOKUP($E23,氏名ﾃﾞｰﾀ!$B:$I,5,0)))","v":""},{"$f":"IF($E23=\"\",\"\",IF(ISERROR(VLOOKUP($E23,氏名ﾃﾞｰﾀ!$B:$I,6,0)),IF(ISERROR(VLOOKUP($E23,登録予定者!$B:$I,6,0)),\"未登録\",VLOOKUP($E23,登録予定者!$B:$I,6,0)),VLOOKUP($E23,氏名ﾃﾞｰﾀ!$B:$I,6,0)))","v":""},"男",null,null,1,{"$error":"#N/A"},"","","",{"$f":"IF(U23=\"\",\"\",RIGHT(B23,2))","v":""},{"$f":"IF(U23=\"\",1,0)","v":1},""]
[{"$f":"100000+B24*100+3","v":100003},0,3,"第３区",null,{"$f":"IF($E24=\"\",\"\",IF(ISERROR(VLOOKUP($E24,氏名ﾃﾞｰﾀ!$B:$I,2,0)),IF(ISERROR(VLOOKUP($E24,登録予定者!$B:$I,2,0)),\"未登録\",VLOOKUP($E24,登録予定者!$B:$I,2,0)),VLOOKUP($E24,氏名ﾃﾞｰﾀ!$B:$I,2,0)))","v":""},{"$f":"IF($E24=\"\",\"\",IF(ISERROR(VLOOKUP($E24,氏名ﾃﾞｰﾀ!$B:$I,3,0)),IF(ISERROR(VLOOKUP($E24,登録予定者!$B:$I,3,0)),\"未登録\",VLOOKUP($E24,登録予定者!$B:$I,3,0)),VLOOKUP($E24,氏名ﾃﾞｰﾀ!$B:$I,3,0)))","v":""},{"$f":"IF($E24=\"\",\"\",IF(ISERROR(VLOOKUP($E24,氏名ﾃﾞｰﾀ!$B:$I,4,0)),IF(ISERROR(VLOOKUP($E24,登録予定者!$B:$I,4,0)),\"未登録\",VLOOKUP($E24,登録予定者!$B:$I,4,0)),VLOOKUP($E24,氏名ﾃﾞｰﾀ!$B:$I,4,0)))","v":""},{"$f":"IF($E24=\"\",\"\",IF(ISERROR(VLOOKUP($E24,氏名ﾃﾞｰﾀ!$B:$I,5,0)),IF(ISERROR(VLOOKUP($E24,登録予定者!$B:$I,5,0)),\"未登録\",VLOOKUP($E24,登録予定者!$B:$I,5,0)),VLOOKUP($E24,氏名ﾃﾞｰﾀ!$B:$I,5,0)))","v":""},{"$f":"IF($E24=\"\",\"\",IF(ISERROR(VLOOKUP($E24,氏名ﾃﾞｰﾀ!$B:$I,6,0)),IF(ISERROR(VLOOKUP($E24,登録予定者!$B:$I,6,0)),\"未登録\",VLOOKUP($E24,登録予定者!$B:$I,6,0)),VLOOKUP($E24,氏名ﾃﾞｰﾀ!$B:$I,6,0)))","v":""},"男",null,null,1,{"$error":"#N/A"},"","","","",1,""]
[{"$f":"100000+B25*100+4","v":100004},0,4,"第４区",null,{"$f":"IF($E25=\"\",\"\",IF(ISERROR(VLOOKUP($E25,氏名ﾃﾞｰﾀ!$B:$I,2,0)),IF(ISERROR(VLOOKUP($E25,登録予定者!$B:$I,2,0)),\"未登録\",VLOOKUP($E25,登録予定者!$B:$I,2,0)),VLOOKUP($E25,氏名ﾃﾞｰﾀ!$B:$I,2,0)))","v":""},{"$f":"IF($E25=\"\",\"\",IF(ISERROR(VLOOKUP($E25,氏名ﾃﾞｰﾀ!$B:$I,3,0)),IF(ISERROR(VLOOKUP($E25,登録予定者!$B:$I,3,0)),\"未登録\",VLOOKUP($E25,登録予定者!$B:$I,3,0)),VLOOKUP($E25,氏名ﾃﾞｰﾀ!$B:$I,3,0)))","v":""},{"$f":"IF($E25=\"\",\"\",IF(ISERROR(VLOOKUP($E25,氏名ﾃﾞｰﾀ!$B:$I,4,0)),IF(ISERROR(VLOOKUP($E25,登録予定者!$B:$I,4,0)),\"未登録\",VLOOKUP($E25,登録予定者!$B:$I,4,0)),VLOOKUP($E25,氏名ﾃﾞｰﾀ!$B:$I,4,0)))","v":""},{"$f":"IF($E25=\"\",\"\",IF(ISERROR(VLOOKUP($E25,氏名ﾃﾞｰﾀ!$B:$I,5,0)),IF(ISERROR(VLOOKUP($E25,登録予定者!$B:$I,5,0)),\"未登録\",VLOOKUP($E25,登録予定者!$B:$I,5,0)),VLOOKUP($E25,氏名ﾃﾞｰﾀ!$B:$I,5,0)))","v":""},{"$f":"IF($E25=\"\",\"\",IF(ISERROR(VLOOKUP($E25,氏名ﾃﾞｰﾀ!$B:$I,6,0)),IF(ISERROR(VLOOKUP($E25,登録予定者!$B:$I,6,0)),\"未登録\",VLOOKUP($E25,登録予定者!$B:$I,6,0)),VLOOKUP($E25,氏名ﾃﾞｰﾀ!$B:$I,6,0)))","v":""},"男",null,null,1,{"$error":"#N/A"},"","","","",1,""]
[{"$f":"100000+B26*100+5","v":100005},0,5,"補欠",null,{"$f":"IF($E26=\"\",\"\",IF(ISERROR(VLOOKUP($E26,氏名ﾃﾞｰﾀ!$B:$I,2,0)),IF(ISERROR(VLOOKUP($E26,登録予定者!$B:$I,2,0)),\"未登録\",VLOOKUP($E26,登録予定者!$B:$I,2,0)),VLOOKUP($E26,氏名ﾃﾞｰﾀ!$B:$I,2,0)))","v":""},{"$f":"IF($E26=\"\",\"\",IF(ISERROR(VLOOKUP($E26,氏名ﾃﾞｰﾀ!$B:$I,3,0)),IF(ISERROR(VLOOKUP($E26,登録予定者!$B:$I,3,0)),\"未登録\",VLOOKUP($E26,登録予定者!$B:$I,3,0)),VLOOKUP($E26,氏名ﾃﾞｰﾀ!$B:$I,3,0)))","v":""},{"$f":"IF($E26=\"\",\"\",IF(ISERROR(VLOOKUP($E26,氏名ﾃﾞｰﾀ!$B:$I,4,0)),IF(ISERROR(VLOOKUP($E26,登録予定者!$B:$I,4,0)),\"未登録\",VLOOKUP($E26,登録予定者!$B:$I,4,0)),VLOOKUP($E26,氏名ﾃﾞｰﾀ!$B:$I,4,0)))","v":""},{"$f":"IF($E26=\"\",\"\",IF(ISERROR(VLOOKUP($E26,氏名ﾃﾞｰﾀ!$B:$I,5,0)),IF(ISERROR(VLOOKUP($E26,登録予定者!$B:$I,5,0)),\"未登録\",VLOOKUP($E26,登録予定者!$B:$I,5,0)),VLOOKUP($E26,氏名ﾃﾞｰﾀ!$B:$I,5,0)))","v":""},{"$f":"IF($E26=\"\",\"\",IF(ISERROR(VLOOKUP($E26,氏名ﾃﾞｰﾀ!$B:$I,6,0)),IF(ISERROR(VLOOKUP($E26,登録予定者!$B:$I,6,0)),\"未登録\",VLOOKUP($E26,登録予定者!$B:$I,6,0)),VLOOKUP($E26,氏名ﾃﾞｰﾀ!$B:$I,6,0)))","v":""},"男",null,null,1,{"$error":"#N/A"},"","","","",1,""]
[{"$f":"100000+B27*100+6","v":100006},0,6,"補欠",null,{"$f":"IF($E27=\"\",\"\",IF(ISERROR(VLOOKUP($E27,氏名ﾃﾞｰﾀ!$B:$I,2,0)),IF(ISERROR(VLOOKUP($E27,登録予定者!$B:$I,2,0)),\"未登録\",VLOOKUP($E27,登録予定者!$B:$I,2,0)),VLOOKUP($E27,氏名ﾃﾞｰﾀ!$B:$I,2,0)))","v":""},{"$f":"IF($E27=\"\",\"\",IF(ISERROR(VLOOKUP($E27,氏名ﾃﾞｰﾀ!$B:$I,3,0)),IF(ISERROR(VLOOKUP($E27,登録予定者!$B:$I,3,0)),\"未登録\",VLOOKUP($E27,登録予定者!$B:$I,3,0)),VLOOKUP($E27,氏名ﾃﾞｰﾀ!$B:$I,3,0)))","v":""},{"$f":"IF($E27=\"\",\"\",IF(ISERROR(VLOOKUP($E27,氏名ﾃﾞｰﾀ!$B:$I,4,0)),IF(ISERROR(VLOOKUP($E27,登録予定者!$B:$I,4,0)),\"未登録\",VLOOKUP($E27,登録予定者!$B:$I,4,0)),VLOOKUP($E27,氏名ﾃﾞｰﾀ!$B:$I,4,0)))","v":""},{"$f":"IF($E27=\"\",\"\",IF(ISERROR(VLOOKUP($E27,氏名ﾃﾞｰﾀ!$B:$I,5,0)),IF(ISERROR(VLOOKUP($E27,登録予定者!$B:$I,5,0)),\"未登録\",VLOOKUP($E27,登録予定者!$B:$I,5,0)),VLOOKUP($E27,氏名ﾃﾞｰﾀ!$B:$I,5,0)))","v":""},{"$f":"IF($E27=\"\",\"\",IF(ISERROR(VLOOKUP($E27,氏名ﾃﾞｰﾀ!$B:$I,6,0)),IF(ISERROR(VLOOKUP($E27,登録予定者!$B:$I,6,0)),\"未登録\",VLOOKUP($E27,登録予定者!$B:$I,6,0)),VLOOKUP($E27,氏名ﾃﾞｰﾀ!$B:$I,6,0)))","v":""},"男",null,null,1,{"$error":"#N/A"},"","","","",1,""]
[null,null,null,"Ｂチーム"]
[{"$f":"100000+B29*100+7","v":100007},{"$f":"$F$15*100+$F$16","v":0},1,"第１区",null,{"$f":"IF($E29=\"\",\"\",IF(ISERROR(VLOOKUP($E29,氏名ﾃﾞｰﾀ!$B:$I,2,0)),IF(ISERROR(VLOOKUP($E29,登録予定者!$B:$I,2,0)),\"未登録\",VLOOKUP($E29,登録予定者!$B:$I,2,0)),VLOOKUP($E29,氏名ﾃﾞｰﾀ!$B:$I,2,0)))","v":""},{"$f":"IF($E29=\"\",\"\",IF(ISERROR(VLOOKUP($E29,氏名ﾃﾞｰﾀ!$B:$I,3,0)),IF(ISERROR(VLOOKUP($E29,登録予定者!$B:$I,3,0)),\"未登録\",VLOOKUP($E29,登録予定者!$B:$I,3,0)),VLOOKUP($E29,氏名ﾃﾞｰﾀ!$B:$I,3,0)))","v":""},{"$f":"IF($E29=\"\",\"\",IF(ISERROR(VLOOKUP($E29,氏名ﾃﾞｰﾀ!$B:$I,4,0)),IF(ISERROR(VLOOKUP($E29,登録予定者!$B:$I,4,0)),\"未登録\",VLOOKUP($E29,登録予定者!$B:$I,4,0)),VLOOKUP($E29,氏名ﾃﾞｰﾀ!$B:$I,4,0)))","v":""},{"$f":"IF($E29=\"\",\"\",IF(ISERROR(VLOOKUP($E29,氏名ﾃﾞｰﾀ!$B:$I,5,0)),IF(ISERROR(VLOOKUP($E29,登録予定者!$B:$I,5,0)),\"未登録\",VLOOKUP($E29,登録予定者!$B:$I,5,0)),VLOOKUP($E29,氏名ﾃﾞｰﾀ!$B:$I,5,0)))","v":""},{"$f":"IF($E29=\"\",\"\",IF(ISERROR(VLOOKUP($E29,氏名ﾃﾞｰﾀ!$B:$I,6,0)),IF(ISERROR(VLOOKUP($E29,登録予定者!$B:$I,6,0)),\"未登録\",VLOOKUP($E29,登録予定者!$B:$I,6,0)),VLOOKUP($E29,氏名ﾃﾞｰﾀ!$B:$I,6,0)))","v":""},"男",null,null,1,{"$f":"CONCATENATE($O$17,\"Ｂ\")","v":{"$error":"#N/A"}},{"$f":"IF(E29=\"\",\"\",CONCATENATE(F29,\"　\",G29))","v":""},{"$f":"IF(E29=\"\",\"\",J29)","v":""},{"$f":"IF(E29=\"\",\"\",$F$15)","v":""},"",1,{"$f":"IF($E$29=\"\",\"\",B29*10+1)","v":""}]
[{"$f":"100000+B30*100+8","v":100008},0,2,"第２区",null,{"$f":"IF($E30=\"\",\"\",IF(ISERROR(VLOOKUP($E30,氏名ﾃﾞｰﾀ!$B:$I,2,0)),IF(ISERROR(VLOOKUP($E30,登録予定者!$B:$I,2,0)),\"未登録\",VLOOKUP($E30,登録予定者!$B:$I,2,0)),VLOOKUP($E30,氏名ﾃﾞｰﾀ!$B:$I,2,0)))","v":""},{"$f":"IF($E30=\"\",\"\",IF(ISERROR(VLOOKUP($E30,氏名ﾃﾞｰﾀ!$B:$I,3,0)),IF(ISERROR(VLOOKUP($E30,登録予定者!$B:$I,3,0)),\"未登録\",VLOOKUP($E30,登録予定者!$B:$I,3,0)),VLOOKUP($E30,氏名ﾃﾞｰﾀ!$B:$I,3,0)))","v":""},{"$f":"IF($E30=\"\",\"\",IF(ISERROR(VLOOKUP($E30,氏名ﾃﾞｰﾀ!$B:$I,4,0)),IF(ISERROR(VLOOKUP($E30,登録予定者!$B:$I,4,0)),\"未登録\",VLOOKUP($E30,登録予定者!$B:$I,4,0)),VLOOKUP($E30,氏名ﾃﾞｰﾀ!$B:$I,4,0)))","v":""},{"$f":"IF($E30=\"\",\"\",IF(ISERROR(VLOOKUP($E30,氏名ﾃﾞｰﾀ!$B:$I,5,0)),IF(ISERROR(VLOOKUP($E30,登録予定者!$B:$I,5,0)),\"未登録\",VLOOKUP($E30,登録予定者!$B:$I,5,0)),VLOOKUP($E30,氏名ﾃﾞｰﾀ!$B:$I,5,0)))","v":""},{"$f":"IF($E30=\"\",\"\",IF(ISERROR(VLOOKUP($E30,氏名ﾃﾞｰﾀ!$B:$I,6,0)),IF(ISERROR(VLOOKUP($E30,登録予定者!$B:$I,6,0)),\"未登録\",VLOOKUP($E30,登録予定者!$B:$I,6,0)),VLOOKUP($E30,氏名ﾃﾞｰﾀ!$B:$I,6,0)))","v":""},"男",null,null,1,{"$error":"#N/A"},"","","","",1,""]
{"$rows_left_out":44}
{"sheet":"男子申込書","index":3,"n_rows":48,"n_cols":12,"rows_kept":48,"cut":false,"hidden":false,"merged":[[46,1,46,2],[47,1,47,2],[42,8,42,10],[40,0,40,10],[42,1,42,6],[3,1,4,4],[3,0,4,0],[3,5,4,5],[0,0,0,10],[45,1,45,2],[32,0,32,10]]}
["令和元年度　新春駅伝競走大会（４・５・６支部）申込書　　　男子用"]
[]
[{"$f":"CONCATENATE(\"第\",入力ｼｰﾄ!F15,\"支部　学校番号\",入力ｼｰﾄ!F16)","v":"第支部　学校番号"}]
["学校名",{"$f":"入力ｼｰﾄ!F2","v":0},null,null,null,"学校\n所在地",{"$f":"CONCATENATE(\"〒\",入力ｼｰﾄ!F4)","v":"〒"}]
[null,null,null,null,null,null,{"$f":"入力ｼｰﾄ!F5","v":0}]
["学校長\n氏名",{"$f":"入力ｼｰﾄ!F3","v":0},null,null,null,"印",null,"顧問氏名",{"$f":"入力ｼｰﾄ!F8","v":0},null,"印　　"]
["省略\n学校名　　",{"$f":"入力ｼｰﾄ!O17","v":{"$error":"#N/A"}},null,"電話番号\n（学校）　　　　",{"$f":"入力ｼｰﾄ!F6","v":0},null,null,"顧問\n連絡先",{"$f":"入力ｼｰﾄ!F9","v":0}]
["Ａチーム"]
["区間","登録番号",null,"氏名",null,null,"学年",null,"健康診断結果"]
["第１区",{"$f":"IF(入力ｼｰﾄ!E22=\"\",\"\",入力ｼｰﾄ!E22)","v":""},{"$f":"CONCATENATE(入力ｼｰﾄ!F22,\" \",入力ｼｰﾄ!G22)","v":" "},null,null,null,{"$f":"入力ｼｰﾄ!J22","v":""},"　　出場は　　（　可　・　否　）"]
["第２区",{"$f":"IF(入力ｼｰﾄ!E23=\"\",\"\",入力ｼｰﾄ!E23)","v":""},{"$f":"CONCATENATE(入力ｼｰﾄ!F23,\" \",入力ｼｰﾄ!G23)","v":" "},null,null,null,{"$f":"入力ｼｰﾄ!J23","v":""},"　　出場は　　（　可　・　否　）"]
["第３区",{"$f":"IF(入力ｼｰﾄ!E24=\"\",\"\",入力ｼｰﾄ!E24)","v":""},{"$f":"CONCATENATE(入力ｼｰﾄ!F24,\" \",入力ｼｰﾄ!G24)","v":" "},null,null,null,{"$f":"入力ｼｰﾄ!J24","v":""},"　　出場は　　（　可　・　否　）"]
["第４区",{"$f":"IF(入力ｼｰﾄ!E25=\"\",\"\",入力ｼｰﾄ!E25)","v":""},{"$f":"CONCATENATE(入力ｼｰﾄ!F25,\" \",入力ｼｰﾄ!G25)","v":" "},null,null,null,{"$f":"入力ｼｰﾄ!J25","v":""},"　　出場は　　（　可　・　否　）"]
["補欠",{"$f":"IF(入力ｼｰﾄ!E26=\"\",\"\",入力ｼｰﾄ!E26)","v":""},{"$f":"CONCATENATE(入力ｼｰﾄ!F26,\" \",入力ｼｰﾄ!G26)","v":" "},null,null,null,{"$f":"入力ｼｰﾄ!J26","v":""},"　　出場は　　（　可　・　否　）"]
["補欠",{"$f":"IF(入力ｼｰﾄ!E27=\"\",\"\",入力ｼｰﾄ!E27)","v":""},{"$f":"CONCATENATE(入力ｼｰﾄ!F27,\" \",入力ｼｰﾄ!G27)","v":" "},null,null,null,{"$f":"入力ｼｰﾄ!J27","v":""},"　　出場は　　（　可　・　否　）"]
["Ｂチーム"]
["区間","登録番号",null,"氏名",null,null,"学年",null,"健康診断結果"]
["第１区",{"$f":"IF(入力ｼｰﾄ!E29=\"\",\"\",入力ｼｰﾄ!E29)","v":""},{"$f":"CONCATENATE(入力ｼｰﾄ!F29,\" \",入力ｼｰﾄ!G29)","v":" "},null,null,null,{"$f":"入力ｼｰﾄ!J29","v":""},"　　出場は　　（　可　・　否　）"]
["第２区",{"$f":"IF(入力ｼｰﾄ!E30=\"\",\"\",入力ｼｰﾄ!E30)","v":""},{"$f":"CONCATENATE(入力ｼｰﾄ!F30,\" \",入力ｼｰﾄ!G30)","v":" "},null,null,null,{"$f":"入力ｼｰﾄ!J30","v":""},"　　出場は　　（　可　・　否　）"]
["第３区",{"$f":"IF(入力ｼｰﾄ!E31=\"\",\"\",入力ｼｰﾄ!E31)","v":""},{"$f":"CONCATENATE(入力ｼｰﾄ!F31,\" \",入力ｼｰﾄ!G31)","v":" "},null,null,null,{"$f":"入力ｼｰﾄ!J31","v":""},"　　出場は　　（　可　・　否　）"]
["第４区",{"$f":"IF(入力ｼｰﾄ!E32=\"\",\"\",入力ｼｰﾄ!E32)","v":""},{"$f":"CONCATENATE(入力ｼｰﾄ!F32,\" \",入力ｼｰﾄ!G32)","v":" "},null,null,null,{"$f":"入力ｼｰﾄ!J32","v":""},"　　出場は　　（　可　・　否　）"]
["補欠",{"$f":"IF(入力ｼｰﾄ!E33=\"\",\"\",入力ｼｰﾄ!E33)","v":""},{"$f":"CONCATENATE(入力ｼｰﾄ!F33,\" \",入力ｼｰﾄ!G33)","v":" "},null,null,null,{"$f":"入力ｼｰﾄ!J33","v":""},"　　出場は　　（　可　・　否　）"]
["補欠",{"$f":"IF(入力ｼｰﾄ!E34=\"\",\"\",入力ｼｰﾄ!E34)","v":""},{"$f":"CONCATENATE(入力ｼｰﾄ!F34,\" \",入力ｼｰﾄ!G34)","v":" "},null,null,null,{"$f":"入力ｼｰﾄ!J34","v":""},"　　出場は　　（　可　・　否　）"]
["Cチーム"]
["区間","登録番号",null,"氏名",null,null,"学年",null,"健康診断結果"]
["第１区",{"$f":"IF(入力ｼｰﾄ!E36=\"\",\"\",入力ｼｰﾄ!E36)","v":""},{"$f":"CONCATENATE(入力ｼｰﾄ!F36,\" \",入力ｼｰﾄ!G36)","v":" "},null,null,null,{"$f":"入力ｼｰﾄ!J36","v":""},"　　出場は　　（　可　・　否　）"]
["第２区",{"$f":"IF(入力ｼｰﾄ!E37=\"\",\"\",入力ｼｰﾄ!E37)","v":""},{"$f":"CONCATENATE(入力ｼｰﾄ!F37,\" \",入力ｼｰﾄ!G37)","v":" "},null,null,null,{"$f":"入力ｼｰﾄ!J37","v":""},"　　出場は　　（　可　・　否　）"]
["第３区",{"$f":"IF(入力ｼｰﾄ!E38=\"\",\"\",入力ｼｰﾄ!E38)","v":""},{"$f":"CONCATENATE(入力ｼｰﾄ!F38,\" \",入力ｼｰﾄ!G38)","v":" "},null,null,null,{"$f":"入力ｼｰﾄ!J38","v":""},"　　出場は　　（　可　・　否　）"]
["第４区",{"$f":"IF(入力ｼｰﾄ!E39=\"\",\"\",入力ｼｰﾄ!E39)","v":""},{"$f":"CONCATENATE(入力ｼｰﾄ!F39,\" \",入力ｼｰﾄ!G39)","v":" "},null,null,null,{"$f":"入力ｼｰﾄ!J39","v":""},"　　出場は　　（　可　・　否　）"]
["補欠",{"$f":"IF(入力ｼｰﾄ!E40=\"\",\"\",入力ｼｰﾄ!E40)","v":""},{"$f":"CONCATENATE(入力ｼｰﾄ!F40,\" \",入力ｼｰﾄ!G40)","v":" "},null,null,null,{"$f":"入力ｼｰﾄ!J40","v":""},"　　出場は　　（　可　・　否　）"]
{"$rows_left_out":19}
{"sheet":"女子申込書","index":4,"n_rows":48,"n_cols":12,"rows_kept":48,"cut":false,"hidden":false,"merged":[[32,0,32,10],[0,0,0,10],[3,0,4,0],[3,5,4,5],[3,1,4,4],[45,1,45,2],[46,1,46,2],[47,1,47,2],[42,1,42,6],[40,0,40,10],[42,8,42,10]]}
["令和元年度　新春駅伝競走大会（４・５・６支部）申込書　　　女子用"]
[]
[{"$f":"CONCATENATE(\"第\",入力ｼｰﾄ!F15,\"支部　学校番号\",入力ｼｰﾄ!F16)","v":"第支部　学校番号"}]
["学校名",{"$f":"入力ｼｰﾄ!F2","v":0},null,null,null,"学校\n所在地",{"$f":"CONCATENATE(\"〒\",入力ｼｰﾄ!F4)","v":"〒"}]
[null,null,null,null,null,null,{"$f":"入力ｼｰﾄ!F5","v":0}]
["学校長\n氏名",{"$f":"入力ｼｰﾄ!F3","v":0},null,null,null,"印",null,"顧問氏名",{"$f":"入力ｼｰﾄ!F8","v":0},null,"印　　"]
["省略\n学校名　　",{"$f":"入力ｼｰﾄ!O17","v":{"$error":"#N/A"}},null,"電話番号\n（学校）　　　　",{"$f":"入力ｼｰﾄ!F6","v":0},null,null,"顧問\n連絡先",{"$f":"入力ｼｰﾄ!F9","v":0}]
["Ａチーム"]
["区間","登録番号",null,"氏名",null,null,"学年",null,"健康診断結果"]
["第１区",{"$f":"IF(入力ｼｰﾄ!E50=\"\",\" \",入力ｼｰﾄ!E50)","v":" "},{"$f":"CONCATENATE(入力ｼｰﾄ!F50,\" \",入力ｼｰﾄ!G50)","v":" "},null,null,null,{"$f":"入力ｼｰﾄ!J50","v":""},"　　出場は　　（　可　・　否　）"]
["第２区",{"$f":"IF(入力ｼｰﾄ!E51=\"\",\" \",入力ｼｰﾄ!E51)","v":" "},{"$f":"CONCATENATE(入力ｼｰﾄ!F51,\" \",入力ｼｰﾄ!G51)","v":" "},null,null,null,{"$f":"入力ｼｰﾄ!J51","v":""},"　　出場は　　（　可　・　否　）"]
["第３区",{"$f":"IF(入力ｼｰﾄ!E52=\"\",\" \",入力ｼｰﾄ!E52)","v":" "},{"$f":"CONCATENATE(入力ｼｰﾄ!F52,\" \",入力ｼｰﾄ!G52)","v":" "},null,null,null,{"$f":"入力ｼｰﾄ!J52","v":""},"　　出場は　　（　可　・　否　）"]
["第４区",{"$f":"IF(入力ｼｰﾄ!E53=\"\",\" \",入力ｼｰﾄ!E53)","v":" "},{"$f":"CONCATENATE(入力ｼｰﾄ!F53,\" \",入力ｼｰﾄ!G53)","v":" "},null,null,null,{"$f":"入力ｼｰﾄ!J53","v":""},"　　出場は　　（　可　・　否　）"]
["補欠",{"$f":"IF(入力ｼｰﾄ!E54=\"\",\" \",入力ｼｰﾄ!E54)","v":" "},{"$f":"CONCATENATE(入力ｼｰﾄ!F54,\" \",入力ｼｰﾄ!G54)","v":" "},null,null,null,{"$f":"入力ｼｰﾄ!J54","v":""},"　　出場は　　（　可　・　否　）"]
["補欠",{"$f":"IF(入力ｼｰﾄ!E55=\"\",\" \",入力ｼｰﾄ!E55)","v":" "},{"$f":"CONCATENATE(入力ｼｰﾄ!F55,\" \",入力ｼｰﾄ!G55)","v":" "},null,null,null,{"$f":"入力ｼｰﾄ!J55","v":""},"　　出場は　　（　可　・　否　）"]
["Ｂチーム"]
["区間","登録番号",null,"氏名",null,null,"学年",null,"健康診断結果"]
["第１区",{"$f":"IF(入力ｼｰﾄ!E57=\"\",\" \",入力ｼｰﾄ!E57)","v":" "},{"$f":"CONCATENATE(入力ｼｰﾄ!F57,\" \",入力ｼｰﾄ!G57)","v":" "},null,null,null,{"$f":"入力ｼｰﾄ!J57","v":""},"　　出場は　　（　可　・　否　）"]
["第２区",{"$f":"IF(入力ｼｰﾄ!E58=\"\",\" \",入力ｼｰﾄ!E58)","v":" "},{"$f":"CONCATENATE(入力ｼｰﾄ!F58,\" \",入力ｼｰﾄ!G58)","v":" "},null,null,null,{"$f":"入力ｼｰﾄ!J58","v":""},"　　出場は　　（　可　・　否　）"]
["第３区",{"$f":"IF(入力ｼｰﾄ!E59=\"\",\" \",入力ｼｰﾄ!E59)","v":" "},{"$f":"CONCATENATE(入力ｼｰﾄ!F59,\" \",入力ｼｰﾄ!G59)","v":" "},null,null,null,{"$f":"入力ｼｰﾄ!J59","v":""},"　　出場は　　（　可　・　否　）"]
["第４区",{"$f":"IF(入力ｼｰﾄ!E60=\"\",\" \",入力ｼｰﾄ!E60)","v":" "},{"$f":"CONCATENATE(入力ｼｰﾄ!F60,\" \",入力ｼｰﾄ!G60)","v":" "},null,null,null,{"$f":"入力ｼｰﾄ!J60","v":""},"　　出場は　　（　可　・　否　）"]
["補欠",{"$f":"IF(入力ｼｰﾄ!E61=\"\",\" \",入力ｼｰﾄ!E61)","v":" "},{"$f":"CONCATENATE(入力ｼｰﾄ!F61,\" \",入力ｼｰﾄ!G61)","v":" "},null,null,null,{"$f":"入力ｼｰﾄ!J61","v":""},"　　出場は　　（　可　・　否　）"]
["補欠",{"$f":"IF(入力ｼｰﾄ!E62=\"\",\" \",入力ｼｰﾄ!E62)","v":" "},{"$f":"CONCATENATE(入力ｼｰﾄ!F62,\" \",入力ｼｰﾄ!G62)","v":" "},null,null,null,{"$f":"入力ｼｰﾄ!J62","v":""},"　　出場は　　（　可　・　否　）"]
["Ｂチーム"]
["区間","登録番号",null,"氏名",null,null,"学年",null,"健康診断結果"]
["第１区",{"$f":"IF(入力ｼｰﾄ!E64=\"\",\" \",入力ｼｰﾄ!E64)","v":" "},{"$f":"CONCATENATE(入力ｼｰﾄ!F64,\" \",入力ｼｰﾄ!G64)","v":" "},null,null,null,{"$f":"入力ｼｰﾄ!J64","v":""},"　　出場は　　（　可　・　否　）"]
["第２区",{"$f":"IF(入力ｼｰﾄ!E65=\"\",\" \",入力ｼｰﾄ!E65)","v":" "},{"$f":"CONCATENATE(入力ｼｰﾄ!F65,\" \",入力ｼｰﾄ!G65)","v":" "},null,null,null,{"$f":"入力ｼｰﾄ!J65","v":""},"　　出場は　　（　可　・　否　）"]
["第３区",{"$f":"IF(入力ｼｰﾄ!E66=\"\",\" \",入力ｼｰﾄ!E66)","v":" "},{"$f":"CONCATENATE(入力ｼｰﾄ!F66,\" \",入力ｼｰﾄ!G66)","v":" "},null,null,null,{"$f":"入力ｼｰﾄ!J66","v":""},"　　出場は　　（　可　・　否　）"]
["第４区",{"$f":"IF(入力ｼｰﾄ!E67=\"\",\" \",入力ｼｰﾄ!E67)","v":" "},{"$f":"CONCATENATE(入力ｼｰﾄ!F67,\" \",入力ｼｰﾄ!G67)","v":" "},null,null,null,{"$f":"入力ｼｰﾄ!J67","v":""},"　　出場は　　（　可　・　否　）"]
["補欠",{"$f":"IF(入力ｼｰﾄ!E68=\"\",\" \",入力ｼｰﾄ!E68)","v":" "},{"$f":"CONCATENATE(入力ｼｰﾄ!F68,\" \",入力ｼｰﾄ!G68)","v":" "},null,null,null,{"$f":"入力ｼｰﾄ!J68","v":""},"　　出場は　　（　可　・　否　）"]
{"$rows_left_out":19}
{"sheet":"省略学校名","index":5,"n_rows":172,"n_cols":7,"rows_kept":172,"cut":false,"hidden":false,"merged":[]}
["支部",1,"コード","ﾌﾘｶﾞﾅ","正式名称","省略","支部"]
["学校番号",2,"ＤＢ","N1","N2","N3","KC"]
[401,401,540401,null,"筑波大学附属駒場高等学校","筑波大駒場","54"]
[402,402,540402,null,"東京学芸大学附属高等学校","学大附","54"]
[403,403,540403,null,"東京都立園芸高等学校","都園芸","54"]
[404,404,540404,null,"東京都立世田谷泉高等学校","都世田谷泉","54"]
[405,405,540405,null,"東京都立世田谷総合高等学校","都世田谷総合","54"]
[406,406,540406,null,"東京都立桜町高等学校","都桜町","54"]
[409,409,540409,null,"東京都立千歳丘高等学校","都千歳丘","54"]
[410,410,540410,null,"東京都立芦花高等学校","都芦花","54"]
[411,411,540411,null,"東京都立松原高等学校","都松原","54"]
[413,413,540413,null,"東京都立深沢高等学校","都深沢","54"]
[414,414,540414,null,"鴎友学園女子高等学校","鴎友学園女","54"]
[415,415,540415,null,"科学技術学園高等学校","科学技術学園","54"]
[417,417,540417,null,"恵泉女学園高等学校","恵泉女学園","54"]
[418,418,540418,null,"佼成学園女子高等学校","佼成学園女","54"]
[419,419,540419,null,"国士舘高等学校","国士舘","54"]
[420,420,540420,null,"駒澤大学高等学校","駒大","54"]
[421,421,540421,null,"駒場学園高等学校","駒場学園","54"]
[422,422,540422,null,"駒場東邦高等学校","駒場東邦","54"]
[423,423,540423,null,"松蔭高等学校","松蔭","54"]
[424,424,540424,null,"昭和女子大学附属昭和高等学校","昭和女子大附","54"]
[425,425,540425,null,"成城学園高等学校","成城学園","54"]
[428,428,540428,null,"世田谷学園高等学校","世田谷学園","54"]
[430,430,540430,null,"大東学園高等学校","大東学園","54"]
[432,432,540432,null,"三田国際学園高等学校","三田国際学園","54"]
[433,433,540433,null,"東京農業大学第一高等学校","東農大一","54"]
[434,434,540434,null,"東京都市大学等々力高等学校","都市大等々力","54"]
[435,435,540435,null,"田園調布学園高等部","田園調布学園","54"]
[436,436,540436,null,"日本女子体育大学附属二階堂高等学校","日女体二階堂","54"]
{"$rows_left_out":143}
{"sheet":"氏名ﾃﾞｰﾀ","index":6,"n_rows":3927,"n_cols":9,"rows_kept":3927,"cut":false,"hidden":true,"merged":[]}
[0,null,"2018，09，28現在"]
[0.1,"５桁","氏名","全角","ﾌﾘｶﾞﾅ","半角","学年",null,"性別"]
[0.2,"半角","性","名","性","名","半角",null,"全角"]
[1,40117,"小松","俊介","ｺﾏﾂ","ｼｭﾝｽｹ",3,null,"男"]
[2,40118,"西原","隆大","ﾆｼﾊﾗ","ﾘｭｳﾀﾞｲ",3,null,"男"]
[3,40119,"奥田","大統","ｵｸﾀﾞ","ﾋﾛﾄ",3,null,"男"]
[4,40120,"増田","翼","ﾏｽﾀﾞ","ﾂﾊﾞｻ",3,null,"男"]
[5,40121,"小野田","吉兆","ｵﾉﾀﾞ","ｷﾖｼ",3,null,"男"]
[6,40122,"山﨑","貴之","ﾔﾏｻﾞｷ","ﾀｶﾕｷ",3,null,"男"]
[7,40123,"畠山","裕亮","ﾊﾀｹﾔﾏ","ﾕｳｽｹ",3,null,"男"]
[8,40124,"稲垣","怜","ｲﾅｶﾞｷ","ﾚｲ",3,null,"男"]
[9,40125,"欧張","沢世","ｵｳﾁｮｳ","ﾀｸﾖ",3,null,"男"]
[10,40126,"香山","怜太","ｶﾔﾏ","ﾘｮｳﾀ",3,null,"男"]
[11,40129,"上田","楽","ｳｴﾀﾞ","ｶﾞｸ",2,null,"男"]
[12,40130,"佐野","小次郎","ｻﾉ","ｺｼﾞﾛｳ",2,null,"男"]
[13,40131,"下出","大智","ｼﾓﾃﾞ","ﾀﾞｲﾁ",2,null,"男"]
[14,40132,"成田","楽","ﾅﾘﾀ","ｶﾞｸ",2,null,"男"]
[15,40133,"松村","薫","ﾏﾂﾑﾗ","ｶｵﾙ",2,null,"男"]
[16,40134,"中西","凛","ﾅｶﾆｼ","ﾘﾝ",3,null,"男"]
[17,40135,"浅岡","凛","ｱｻｵｶ","ﾘﾝ",1,null,"男"]
[18,40136,"粟野","稜也","ｱﾜﾉ","ﾘｮｳﾔ",1,null,"男"]
[19,40137,"安藤","翔太郎","ｱﾝﾄﾞｳ","ｼｮｳﾀﾛｳ",1,null,"男"]
[20,40138,"石津","昂椰","ｲｼﾂﾞ","ｺｳﾔ",1,null,"男"]
[21,40139,"佐々木","陽生","ｻｻｷ","ﾊﾙﾄ",1,null,"男"]
[22,40140,"瀧野","幹拡","ﾀｷﾉ","ﾐｷﾋﾛ",1,null,"男"]
[23,40141,"土屋","皓太郎","ﾂﾁﾔ","ｺｳﾀﾛｳ",1,null,"男"]
[24,40142,"緑川","汰也","ﾐﾄﾞﾘｶﾜ","ﾀｲﾔ",1,null,"男"]
[25,40143,"森田","剛煕","ﾓﾘﾀ","ｺﾞｳｷ",1,null,"男"]
[26,40144,"赤羽","克仁","ｱｶﾊﾞﾈ","ｶﾂﾋﾄ",1,null,"男"]
[27,40201,"荻野","雄渡","ｵｷﾞﾉ","ﾕｳﾄ",2,null,"男"]
{"$rows_left_out":3897}